BDBM50064586 3-Methyl-6-{2-[4-(3-trifluoromethyl-phenyl)-piperazin-1-yl]-ethyl}-3H-benzothiazol-2-one::CHEMBL418499
SMILES Cn1c2ccc(CCN3CCN(CC3)c3cccc(c3)C(F)(F)F)cc2sc1=O
InChI Key InChIKey=YURVPEXVKWCAQY-UHFFFAOYSA-N
Data  6 IC50
  Tab Delimited (TSV)   2D SDfile   Computed 3D by Vconf -m prep SDfile
Find this compound or compounds like it in BindingDB:
Activity Spreadsheet -- Enzyme Inhibition Constant Data from BindingDB
Found 1 hit for monomerid = 50064586
Target5-hydroxytryptamine receptor 2C(Homo sapiens (Human))
Institut De Chimie Pharmaceutique Albert Lespagnol
Curated by ChEMBL
LigandPNGBDBM50064586(3-Methyl-6-{2-[4-(3-trifluoromethyl-phenyl)-pipera...)
Affinity DataIC50: >1.00E+4nM. Assay description: Affinity towards 5-hydroxytryptamine 2C receptor in membranes from pig choroid plexus using [3H]-N-methyl-mesulergine
In DepthDetails ArticlePubMed